Case number,First name,Last name,Position,Position long,Injury date,Cumulative injury*,PLAYED_IN_CALIFORNIA,Head injury,Application date,Year,Employers,Detail
ADJ8390688,Scott,Abeyta,,,06/01/1997 - 12/31/2000,Y,yes,Y,6/18/2012,2012,"Arizona Diamondbacks,Sacramento Steelheads",/workers-comp-mlb/popup/ADJ8390688.html
ADJ6784302,Paul,Abraham,P,Pitcher,6/30/2007,N,yes,Y,4/20/2009,2009,"Portland Beavers,San Diego Padres",/workers-comp-mlb/popup/ADJ6784302.html
ADJ8672288,Art,Adams,P,Pitcher,06/01/1991 - 12/31/1993,Y,no,Y,12/14/2012,2012,Detroit Tigers,/workers-comp-mlb/popup/ADJ8672288.html
ADJ421507,Mike ,Adams,,,4/30/1986,N,no,N,11/8/1991,1991,Minnesota Twins,/workers-comp-mlb/popup/ADJ421507.html
ADJ7912521,Terry,Adams,P,Pitcher,06/01/1991 - 09/05/2006,Y,no,Y,6/28/2011,2011,"Philadelphia Phillies,Boston Red Sox",/workers-comp-mlb/popup/ADJ7912521.html
ADJ4049445,Willie,Adams,P,Pitcher,8/15/1994,N,yes,N,6/15/1995,1995,Oakland Athletics,/workers-comp-mlb/popup/ADJ4049445.html
ADJ8808893,Alan,Ahmady,,,4/15/2012,N,no,N,3/11/2013,2013,St. Louis Cardinals,/workers-comp-mlb/popup/ADJ8808893.html
ADJ8812861,Alan,Ahmady,,,5/15/2012,N,no,Y,3/13/2013,2013,St. Louis Cardinals,/workers-comp-mlb/popup/ADJ8812861.html
ADJ8814308,Alan,Ahmady,,,08/13/2012 - 03/10/2013,Y,no,Y,3/13/2013,2013,St. Louis Cardinals,/workers-comp-mlb/popup/ADJ8814308.html
ADJ4587391,Jose,Alcantara,,,6/29/1996,N,yes,N,2/4/1997,1997,San Francisco Giants,/workers-comp-mlb/popup/ADJ4587391.html
ADJ8385952,Edgardo,Alfonzo,3B-2B,Third baseman and Second baseman,02/19/1991 - 06/12/2006,Y,no,Y,6/14/2012,2012,New York Mets,/workers-comp-mlb/popup/ADJ8385952.html
ADJ8669714,Luis,Alicea,2B-3B,Second baseman and Third baseman,04/01/1993 - 10/15/2002,Y,no,Y,12/12/2012,2012,Kansas City Royals,/workers-comp-mlb/popup/ADJ8669714.html
ADJ8747600,Matt,Allegra,,,06/01/2000 - 09/30/2007,Y,yes,N,2/4/2013,2013,Oakland Athletics,/workers-comp-mlb/popup/ADJ8747600.html
ADJ2577318,Dick,Allen,1B-3B-LF,"First baseman, Third baseman and Left fielder ",06/03/1960 - 06/11/1978,Y,yes,N,8/25/1988,1988,"Los Angeles Dodgers,Chicago White Sox,Oakland Athletics,St. Louis Cardinals,Philadelphia Phillies,Atlanta Braves",/workers-comp-mlb/popup/ADJ2577318.html
ADJ2850264,Dick,Allen,1B-3B-LF,"First baseman, Third baseman and Left fielder ",06/03/1960 - 06/11/1978,Y,yes,N,8/5/1988,1988,Los Angeles Dodgers,/workers-comp-mlb/popup/ADJ2850264.html
ADJ3815134,Dick,Allen,,,4/11/1990,N,no,N,4/11/1990,1990,Texas Rangers,/workers-comp-mlb/popup/ADJ3815134.html
ADJ3951759,Dick,Allen,1B-3B-LF,"First baseman, Third baseman and Left fielder ",12/20/1984 - 10/15/1985,Y,no,N,4/11/1990,1990,Chicago White Sox,/workers-comp-mlb/popup/ADJ3951759.html
ADJ1863373,Patrick,Allen,,,4/4/2006,N,yes,N,5/27/2008,2008,San Diego Padres,/workers-comp-mlb/popup/ADJ1863373.html
ADJ8061488,David,Aloi,,,06/01/1973 - 12/31/1978,Y,no,Y,10/6/2011,2011,Houston Astros,/workers-comp-mlb/popup/ADJ8061488.html
ADJ8652668,Sandy,Alomar,C,Catcher,09/11/1988 - 09/30/2007,Y,no,N,11/29/2012,2012,New York Mets,/workers-comp-mlb/popup/ADJ8652668.html
ADJ3088833,Rich,Amaral,OF-2B-1B,"Outfielder, Second baseman and First baseman",06/06/1983 - 10/18/2000,Y,no,N,10/19/2004,2004,"Chicago White Sox,Baltimore Orioles,Seattle Mariners,Chicago Cubs,Atlanta Braves",/workers-comp-mlb/popup/ADJ3088833.html
ADJ1657415,Bill,Anderson,P,Pitcher,05/13/1994 - 09/15/1999,Y,yes,Y,1/12/2000,2000,"Anaheim Angels,San Diego Padres",/workers-comp-mlb/popup/ADJ1657415.html
ADJ8505870,Brian,Anderson,P,Pitcher,06/01/2005 - 03/23/2011,Y,yes,N,8/28/2012,2012,San Francisco Giants,/workers-comp-mlb/popup/ADJ8505870.html
ADJ6966511,Derek,Anderson,,,01/01/1999 - 12/31/2005,Y,no,Y,10/5/2009,2009,Tampa Bay Rays,/workers-comp-mlb/popup/ADJ6966511.html
ADJ8630686,Marlon,Anderson,2B-PH-OF,"Second baseman, Pinch hitter and Outfielder",02/01/1995 - 05/30/2009,Y,no,Y,11/16/2012,2012,New York Mets,/workers-comp-mlb/popup/ADJ8630686.html
ADJ2708857,Russell,Applegate,,,8/15/1986,N,yes,N,10/6/1987,1987,Oakland Athletics,/workers-comp-mlb/popup/ADJ2708857.html
ADJ4508605,Russell,Applegate,,,08/15/1985 - 08/15/1986,Y,yes,N,10/6/1987,1987,Oakland Athletics,/workers-comp-mlb/popup/ADJ4508605.html
ADJ7619907,Luis,Aquino,P,Pitcher,06/15/1981 - 04/15/1998,Y,yes,Y,1/3/2011,2011,"Detroit Tigers,Boston Red Sox,Baltimore Orioles,Kansas City Royals,Washington Nationals,Florida Marlins,San Francisco Giants,Toronto Blue Jays",/workers-comp-mlb/popup/ADJ7619907.html
ADJ7798858,Alex,Arias,SS-PH-3B,"Shortstop, Pinch hitter and Third baseman",06/06/1987 - 10/28/2002,Y,yes,Y,4/18/2011,2011,"Baltimore Orioles,Chicago Cubs,Philadelphia Phillies,San Diego Padres,Florida Marlins,New York Yankees",/workers-comp-mlb/popup/ADJ7798858.html
ADJ3344913,Mitch,Arnold,P,Pitcher,4/18/2005,N,yes,N,3/10/2008,2008,Anaheim Angels,/workers-comp-mlb/popup/ADJ3344913.html
ADJ7782101,Rene,Arocha,P,Pitcher,11/21/1991 - 08/23/2000,Y,yes,Y,4/14/2011,2011,"Houston Astros,New York Yankees,New York Mets,St. Louis Cardinals,San Francisco Giants",/workers-comp-mlb/popup/ADJ7782101.html
ADJ7673543,Rolando,Arrojo,P,Pitcher,09/22/2001 - 09/22/2002,Y,no,Y,1/31/2011,2011,Boston Red Sox,/workers-comp-mlb/popup/ADJ7673543.html
ADJ8727793,Rick,Asadoorian,P,Pitcher,09/15/1999 - 08/19/2011,Y,no,Y,1/22/2013,2013,Texas Rangers,/workers-comp-mlb/popup/ADJ8727793.html
ADJ1247970,Billy,Ashley,LF-PH,Left fielder and Pinch hitter,04/02/1998 - 10/01/1998,Y,no,N,2/19/2002,2002,"Boston Red Sox,Toledo Mud Hens/Detroit Tigers",/workers-comp-mlb/popup/ADJ1247970.html
ADJ8673742,Jason,Aspito,,,06/03/2000 - 09/30/2009,Y,yes,Y,12/17/2012,2012,Los Angeles Angeles of Anaheim,/workers-comp-mlb/popup/ADJ8673742.html
ADJ8897361,Keith,Atherton,P,Pitcher,07/01/1978 - 10/01/1989,Y,no,Y,5/6/2013,2013,Cleveland Indians,/workers-comp-mlb/popup/ADJ8897361.html
ADJ8741403,David,Austen,,,06/01/2003 - 09/07/2009,Y,yes,Y,1/30/2013,2013,Los Angeles Angeles of Anaheim,/workers-comp-mlb/popup/ADJ8741403.html
ADJ7627104,Bruce,Aven,OF-PH,Outfielder and Pinch hitter,08/06/2000 - 12/31/2003,Y,yes,Y,1/10/2011,2011,Los Angeles Dodgers,/workers-comp-mlb/popup/ADJ7627104.html
ADJ4269102,Rolo,Avila,OF,Outfielder,4/15/1997,N,yes,N,11/7/2002,2002,Los Angeles Dodgers,/workers-comp-mlb/popup/ADJ4269102.html
ADJ8771834,Corey,Avrard,,,01/01/1994 - 12/31/2004,Y,no,Y,2/19/2013,2013,Seattle Mariners,/workers-comp-mlb/popup/ADJ8771834.html
ADJ8559116,Benny,Ayala,PH-LF-DH,"Pinch hitter, Left fielder and Designated hitter",01/28/1971 - 11/12/1985,Y,no,Y,10/2/2012,2012,New York Mets,/workers-comp-mlb/popup/ADJ8559116.html
ADJ8020515,Carlos,Baerga,2B-3B,Second baseman and Third baseman,11/04/1985 - 10/28/2005,Y,yes,Y,9/14/2011,2011,"Seattle Mariners,Cincinnati Reds,Cleveland Indians,Arizona Diamondbacks,San Diego Padres,Boston Red Sox",/workers-comp-mlb/popup/ADJ8020515.html
ADJ1504065,David,Bagley,,,6/14/2002,N,yes,N,7/9/2007,2007,Los Angeles Dodgers,/workers-comp-mlb/popup/ADJ1504065.html
ADJ4295350,David,Bagley,,,06/01/2002 - 09/15/2004,Y,yes,Y,9/7/2006,2006,Los Angeles Dodgers,/workers-comp-mlb/popup/ADJ4295350.html
ADJ4469994,Pichi,Balet,,,8/4/2004,N,no,N,2/10/2005,2005,Colorado Rockies,/workers-comp-mlb/popup/ADJ4469994.html
ADJ8237485,Jarred,Ball,,,07/29/2001 - 09/01/2008,Y,no,N,11/16/2011,2011,Houston Astros,/workers-comp-mlb/popup/ADJ8237485.html
ADJ8606594,Jeff,Ball,PH-1B,Pinch hitter and First baseman,06/22/1990 - 09/01/2003,Y,yes,N,5/9/2012,2012,San Francisco Giants,/workers-comp-mlb/popup/ADJ8606594.html
ADJ8735668,Jeff,Ball,PH-1B,Pinch hitter and First baseman,06/22/1990 - 09/01/1999,Y,yes,N,10/24/2012,2012,San Francisco Giants,/workers-comp-mlb/popup/ADJ8735668.html
ADJ2738919,Doug,Banning,,,5/16/1987,N,yes,N,7/23/1987,1987,California Angels,/workers-comp-mlb/popup/ADJ2738919.html
ADJ1346830,Douglas,Barba,,,09/15/1984 - 09/15/1985,Y,no,Y,4/19/1991,1991,"Cincinnati Reds,New York Mets",/workers-comp-mlb/popup/ADJ1346830.html
ADJ1852695,Douglas,Barba,,,3/15/1982,N,no,N,4/11/1991,1991,Cincinnati Reds,/workers-comp-mlb/popup/ADJ1852695.html
ADJ2535909,Lorenzo,Barcelo,P,Pitcher,05/23/1994 - 07/09/2003,Y,yes,Y,6/2/2005,2005,"Chicago White Sox,San Francisco Giants",/workers-comp-mlb/popup/ADJ2535909.html
ADJ8661543,Jesse,Barfield,RF,Right fielder,06/01/1977 - 10/15/1992,Y,no,Y,12/10/2012,2012,New York Yankees,/workers-comp-mlb/popup/ADJ8661543.html
ADJ7425715,Sean,Barker,PH-OF,Pinch hitter and Outfielder,06/01/2002 - 09/05/2008,Y,no,Y,8/24/2010,2010,Colorado Rockies,/workers-comp-mlb/popup/ADJ7425715.html
ADJ603768,Jeff,Barry,OF-PH,Outfielder and Pinch hitter,8/25/1995,N,no,N,2/22/1996,1996,New York Mets,/workers-comp-mlb/popup/ADJ603768.html
ADJ8447744,Kevin,Bass,RF,Right fielder,02/01/1977 - 10/01/1999,Y,no,Y,7/16/2012,2012,Baltimore Orioles,/workers-comp-mlb/popup/ADJ8447744.html
ADJ7532909,Justin,Baum,,,03/10/2007 - 06/05/2010,Y,yes,N,10/28/2010,2010,San Diego Padres,/workers-comp-mlb/popup/ADJ7532909.html
ADJ4594708,Pat,Bayless,P,Pitcher,5/15/1971,N,no,N,10/19/1990,1990,Philadelphia Phillies,/workers-comp-mlb/popup/ADJ4594708.html
ADJ8719565,Trey,Beamon,PH-OF,Pinch hitter and Outfielder,02/01/1992 - 10/01/1998,Y,no,N,1/15/2013,2013,Detroit Tigers,/workers-comp-mlb/popup/ADJ8719565.html
ADJ8674703,Andrew,Beattie,,,01/01/1998 - 12/31/2008,Y,no,Y,12/17/2012,2012,Florida Marlins,/workers-comp-mlb/popup/ADJ8674703.html
ADJ8838420,James,Beauchamp,,,06/01/1982 - 10/01/2001,Y,yes,Y,3/28/2013,2013,Oakland Athletics,/workers-comp-mlb/popup/ADJ8838420.html
ADJ8741089,Matt,Beech,P,Pitcher,04/01/1994 - 09/30/2007,Y,no,Y,1/30/2013,2013,"Texas Rangers,Philadelphia Phillies",/workers-comp-mlb/popup/ADJ8741089.html
ADJ8739571,Marvin,Benard,OF,Outfielder,02/01/1992 - 08/30/2004,Y,yes,N,1/29/2013,2013,San Francisco Giants,/workers-comp-mlb/popup/ADJ8739571.html
ADJ8567494,Gary,Bennett,C,Catcher,06/04/1990 - 11/05/2008,Y,no,Y,10/8/2012,2012,"Colorado Rockies,Philadelphia Phillies",/workers-comp-mlb/popup/ADJ8567494.html
ADJ8113028,Jon,Berger,P,Pitcher,06/09/2009 - 06/30/2011,Y,yes,Y,11/14/2011,2011,San Diego Padres,/workers-comp-mlb/popup/ADJ8113028.html
ADJ7932654,Dave,Bergman,1B-PH-LF,"First baseman, Pinch hitter and Left fielder",06/01/1974 - 10/04/1992,Y,no,Y,7/13/2011,2011,Detroit Tigers,/workers-comp-mlb/popup/ADJ7932654.html
ADJ8212569,Geronimo,Berroa,RF-DH,Right fielder and Designated hitter,12/05/1988 - 10/14/2000,Y,yes,Y,2/24/2012,2012,"Los Angeles Dodgers,Detroit Tigers,Atlanta Braves,Baltimore Orioles,Cleveland Indians,Cincinnati Reds,Seattle Mariners,Oakland Athletics,Florida Marlins,Toronto Blue Jays",/workers-comp-mlb/popup/ADJ8212569.html
ADJ4162078,Jason,Berry,,,6/28/1998,N,yes,N,8/21/2000,2000,Oakland Athletics,/workers-comp-mlb/popup/ADJ4162078.html
ADJ1337669,Jim,Betzsold,OF-1B,Outfielder and First baseman,7/2/2001,N,no,N,10/22/2001,2001,Seattle Mariners,/workers-comp-mlb/popup/ADJ1337669.html
ADJ1867796,Jim,Betzsold,OF-1B,Outfielder and First baseman,02/01/2002 - 03/19/2002,Y,yes,N,4/12/2007,2007,Los Angeles Dodgers,/workers-comp-mlb/popup/ADJ1867796.html
ADJ678908,Jim,Betzsold,OF-1B,Outfielder and First baseman,07/02/2000 - 07/02/2001,Y,no,Y,1/30/2003,2003,Seattle Mariners,/workers-comp-mlb/popup/ADJ678908.html
ADJ8389936,Shomari,Beverly,,,01/01/1997 - 12/31/2000,Y,no,Y,6/18/2012,2012,Philadelphia Phillies,/workers-comp-mlb/popup/ADJ8389936.html
ADJ8641422,Nick,Bierbrodt,P,Pitcher,06/01/1996 - 12/31/2011,Y,yes,Y,11/26/2012,2012,"Long Beach Armada,Texas Rangers,Tampa Bay Rays,Arizona Diamondbacks",/workers-comp-mlb/popup/ADJ8641422.html
ADJ1156841,Brent,Billingsley,P,Pitcher,5/15/2000,N,no,N,4/17/2007,2007,Montreal Expos,/workers-comp-mlb/popup/ADJ1156841.html
ADJ4054585,Brent,Billingsley,P,Pitcher,4/15/2003,N,no,N,3/12/2007,2007,Philadelphia Phillies,/workers-comp-mlb/popup/ADJ4054585.html
ADJ4240884,Brent,Billingsley,P,Pitcher,3/2/2007,N,no,N,3/2/2007,2007,"Colorado Rockies,Newark Bears,Montreal Expos,Philadelphia Phillies,Florida Marlins",/workers-comp-mlb/popup/ADJ4240884.html
ADJ8693215,Justin,Blaine,P,Pitcher,06/01/2005 - 03/01/2008,Y,no,N,12/28/2012,2012,Philadelphia Phillies,/workers-comp-mlb/popup/ADJ8693215.html
ADJ8504643,Darren,Blakely,,,06/01/1998 - 12/31/2010,Y,yes,Y,8/27/2012,2012,"Los Angeles Angeles of Anaheim,San Diego Padres",/workers-comp-mlb/popup/ADJ8504643.html
ADJ3507001,Henry,Blanco,C,Catcher,6/20/1997,N,yes,N,7/13/1998,1998,Los Angeles Dodgers,/workers-comp-mlb/popup/ADJ3507001.html
ADJ4555310,Henry,Blanco,C,Catcher,12/12/1989 - 11/13/1997,Y,yes,Y,1/13/1998,1998,Los Angeles Dodgers,/workers-comp-mlb/popup/ADJ4555310.html
ADJ1236746,Lance,Blankenship,OF-2B-3B,"Outfielder, Second baseman and Third baseman",8/15/1993,N,yes,N,12/23/1996,1996,Oakland Athletics,/workers-comp-mlb/popup/ADJ1236746.html
ADJ8439009,Greg,Blosser,LF-PH,Left fielder and Pinch hitter,06/14/1989 - 12/31/2008,Y,yes,Y,7/18/2012,2012,San Francisco Giants,/workers-comp-mlb/popup/ADJ8439009.html
ADJ3853479,Eric,Boardman,,,5/20/1999,N,no,N,5/21/1999,1999,"New York Yankees,George Corson",/workers-comp-mlb/popup/ADJ3853479.html
ADJ4435239,Eric,Boardman,,,5/20/1999,N,no,N,5/21/1999,1999,"New York Yankees,George Corson",/workers-comp-mlb/popup/ADJ4435239.html
ADJ8873503,Hiram,Bocachica,OF-PH-2B,"Outfielder, Pinch hitter and Second baseman",09/13/2000 - 07/17/2007,Y,yes,Y,4/17/2013,2013,"Oakland Athletics,San Diego Padres",/workers-comp-mlb/popup/ADJ8873503.html
ADJ8556394,Stan,Boderick,,,02/01/1982 - 10/01/1985,Y,yes,N,8/28/2012,2012,"Oakland Athletics,Chicago Cubs",/workers-comp-mlb/popup/ADJ8556394.html
ADJ8708104,Frank,Bolick,1B-PH-3B,"First baseman, Pinch hitter and Third baseman",06/12/1987 - 06/03/1998,Y,yes,Y,1/8/2013,2013,Los Angeles Angeles of Anaheim,/workers-comp-mlb/popup/ADJ8708104.html
ADJ8864685,Steven,Bondurant,P,Pitcher,06/01/2003 - 06/16/2007,Y,yes,Y,4/15/2013,2013,Oakland Athletics,/workers-comp-mlb/popup/ADJ8864685.html
ADJ7137685,Matt,Boone,,,07/01/1997 - 03/01/2004,Y,no,Y,2/10/2010,2010,"Cincinnati Reds,Seattle Mariners",/workers-comp-mlb/popup/ADJ7137685.html
ADJ3844493,Kevin,Bootay,,,4/18/1989,N,no,N,6/26/1990,1990,Philadelphia Phillies,/workers-comp-mlb/popup/ADJ3844493.html
ADJ4238482,Bill,Bordley,P,Pitcher,09/01/1981 - 09/01/1982,Y,yes,Y,10/12/1983,1983,San Francisco Giants,/workers-comp-mlb/popup/ADJ4238482.html
ADJ4362416,Richard,Borowski,,,4/10/1985,N,yes,N,2/13/1990,1990,Oakland Athletics,/workers-comp-mlb/popup/ADJ4362416.html
ADJ6810756,Chris,Bosio,P,Pitcher,01/12/1982 - 04/15/1998,Y,no,Y,6/16/2009,2009,"Milwaukee Brewers,Boston Red Sox",/workers-comp-mlb/popup/ADJ6810756.html
ADJ8784693,Kip,Bouknight,,,06/01/2001 - 12/31/2009,Y,no,Y,2/26/2013,2013,"Washington Nationals,Colorado Rockies",/workers-comp-mlb/popup/ADJ8784693.html
ADJ994118,Mitch,Bowen,P,Pitcher,5/19/1996,N,no,N,9/10/1997,1997,Florida Marlins,/workers-comp-mlb/popup/ADJ994118.html
ADJ8272393,Jason,Bowers,,,06/01/1998 - 12/31/2009,Y,yes,Y,4/4/2012,2012,"Washington Nationals,San Francisco Giants,Baltimore Orioles,Tampa Bay Rays,Pittsburgh Pirates,St. Louis Cardinals",/workers-comp-mlb/popup/ADJ8272393.html
ADJ8838425,Brian,Bowles,P,Pitcher,08/23/1994 - 05/21/2007,Y,yes,Y,3/28/2013,2013,San Francisco Giants,/workers-comp-mlb/popup/ADJ8838425.html
ADJ7783473,Patrick,Boyd,,,01/16/2002 - 12/31/2004,Y,no,Y,4/14/2011,2011,Texas Rangers,/workers-comp-mlb/popup/ADJ7783473.html
ADJ8560945,Kyle,Boyer,,,06/01/2003 - 09/01/2005,Y,no,N,6/28/2012,2012,Chicago Cubs,/workers-comp-mlb/popup/ADJ8560945.html
ADJ8783981,Michael,Brambilla,,,06/01/1996 - 03/01/1998,Y,no,N,2/26/2013,2013,Kansas City Royals,/workers-comp-mlb/popup/ADJ8783981.html
ADJ1443753,Fred,Breining,P,Pitcher,11/15/1983,N,yes,N,3/2/1992,1992,San Francisco Giants,/workers-comp-mlb/popup/ADJ1443753.html
ADJ2969214,Eric,Brooks,,,5/24/1991,N,no,N,5/16/1996,1996,Toronto Blue Jays,/workers-comp-mlb/popup/ADJ2969214.html
ADJ8329707,Ramy,Brooks,C-1B,Catcher and First baseman,06/01/1990 - 09/30/1998,Y,no,Y,5/11/2012,2012,Kansas City Royals,/workers-comp-mlb/popup/ADJ8329707.html
ADJ7020690,Bob,Brower,OF,Outfielder,01/01/1982 - 12/31/1990,Y,no,Y,11/4/2009,2009,New York Yankees,/workers-comp-mlb/popup/ADJ7020690.html
ADJ8747601,Andrew,Brown,P,Pitcher,06/01/1999 - 09/30/2010,Y,yes,N,2/4/2013,2013,"San Diego Padres,St. Louis Cardinals,Oakland Athletics",/workers-comp-mlb/popup/ADJ8747601.html
ADJ8195703,Darold,Brown,,,07/01/1993 - 12/31/2001,Y,yes,Y,1/4/2012,2012,"Solano Steelheads,Chicago Cubs,Atlanta Braves",/workers-comp-mlb/popup/ADJ8195703.html
ADJ8437061,Darrell,Brown,CF,Center fielder,03/15/1982 - 09/30/1984,Y,yes,Y,7/17/2012,2012,"Minnesota Twins,Oakland Athletics",/workers-comp-mlb/popup/ADJ8437061.html
ADJ8379400,Dee,Brown,LF,Left fielder,06/01/1996 - 12/31/2011,Y,yes,Y,6/11/2012,2012,"Los Angeles Angeles of Anaheim,Los Angeles Dodgers,Arizona Diamondbacks,Oakland Athletics",/workers-comp-mlb/popup/ADJ8379400.html
ADJ3281727,Kevin,Brown,P,Pitcher,5/21/1995,N,no,N,1/4/1996,1996,Kansas City Royals,/workers-comp-mlb/popup/ADJ3281727.html
ADJ865975,Kevin,Brown,P,Pitcher,01/01/1986 - 12/31/1995,Y,no,Y,6/18/2003,2003,"Kansas City Royals,Terre L. Sadosky Law Office",/workers-comp-mlb/popup/ADJ865975.html
ADJ7717072,Roosevelt,Brown,LF-PH,Left fielder and Pinch hitter,06/01/1993 - 09/01/2005,Y,no,N,12/29/2010,2010,Chicago Cubs,/workers-comp-mlb/popup/ADJ7717072.html
ADJ3257773,Willie,Brown,P,Pitcher,01/01/1995 - 01/01/1996,Y,yes,N,6/18/1997,1997,California Angels,/workers-comp-mlb/popup/ADJ3257773.html
ADJ8714609,Byron,Browne,P,Pitcher,01/01/1991 - 01/01/2000,Y,no,Y,1/11/2013,2013,Milwaukee Brewers,/workers-comp-mlb/popup/ADJ8714609.html
ADJ8872990,Jerry,Browne,2B-OF-3B,"Second baseman, Outfielder and Third baseman",09/06/1986 - 10/01/1995,Y,yes,Y,4/17/2013,2013,"Miami Marlins,Oakland Athletics",/workers-comp-mlb/popup/ADJ8872990.html
ADJ8860267,Byron,Browne Jr,,,6/2/1997,N,no,Y,4/11/2013,2013,Milwaukee Brewers,/workers-comp-mlb/popup/ADJ8860267.html
ADJ8566343,Jim,Bullard,P,Pitcher,06/01/2001 - 09/01/2006,Y,yes,N,7/5/2012,2012,San Diego Padres,/workers-comp-mlb/popup/ADJ8566343.html
ADJ1347533,Sean,Buller,,,06/01/1998 - 10/01/2001,Y,no,Y,6/26/2003,2003,Detroit Tigers,/workers-comp-mlb/popup/ADJ1347533.html
ADJ1753830,Eric,Bullock,PH-OF,Pinch hitter and Outfielder,01/15/1995 - 09/15/2002,Y,yes,N,9/30/2002,2002,San Diego Padres,/workers-comp-mlb/popup/ADJ1753830.html
ADJ6836932,Dave,Burba,P,Pitcher,02/15/1990 - 10/29/2004,Y,yes,Y,7/3/2009,2009,San Francisco Giants,/workers-comp-mlb/popup/ADJ6836932.html
ADJ507824,Jerry,Burns,,,5/15/1993,N,yes,N,3/12/1996,1996,San Diego Padres,/workers-comp-mlb/popup/ADJ507824.html
ADJ8379413,Adrian,Burnside,,,07/12/1995 - 12/31/2011,Y,yes,Y,6/11/2012,2012,San Diego Padres,/workers-comp-mlb/popup/ADJ8379413.html
ADJ8871644,Mike,Busch,3B-PH-1B,"Third baseman, Pinch hitter and First baseman",06/08/1990 - 06/30/2001,Y,yes,Y,4/18/2013,2013,Los Angeles Dodgers,/workers-comp-mlb/popup/ADJ8871644.html
ADJ8871670,Mike,Busch,3B-PH-1B,"Third baseman, Pinch hitter and First baseman",5/13/1991,N,yes,N,4/18/2013,2013,Los Angeles Dodgers,/workers-comp-mlb/popup/ADJ8871670.html
ADJ8248317,Brok,Butcher,,,03/01/2006 - 10/31/2011,Y,yes,Y,3/20/2012,2012,Los Angeles Angeles of Anaheim,/workers-comp-mlb/popup/ADJ8248317.html
ADJ3675869,Chris,Butterfield,,,2/21/1995,N,yes,N,8/27/1997,1997,Los Angeles Dodgers,/workers-comp-mlb/popup/ADJ3675869.html
ADJ8739003,Mike ,Bynum,P,Pitcher,06/02/1999 - 10/15/2004,Y,yes,Y,1/29/2013,2013,"San Diego Padres,Rancho Cucamonga Quakes,Idaho Falls Padres",/workers-comp-mlb/popup/ADJ8739003.html
ADJ8558514,Kiko,Calero,P,Pitcher,11/21/2002 - 07/19/2010,Y,no,Y,10/2/2012,2012,St. Louis Cardinals,/workers-comp-mlb/popup/ADJ8558514.html
ADJ8664756,Kevin,Cameron,P,Pitcher,04/05/2007 - 06/01/2009,Y,yes,N,12/10/2012,2012,Oakland Athletics,/workers-comp-mlb/popup/ADJ8664756.html
ADJ2301118,Sean,Campbell,,,07/19/1999 - 07/19/2000,Y,yes,N,5/25/2001,2001,San Diego Padres,/workers-comp-mlb/popup/ADJ2301118.html
ADJ3199280,Sean,Campbell,,,7/19/2000,N,yes,N,5/31/2001,2001,San Diego Padres,/workers-comp-mlb/popup/ADJ3199280.html
ADJ8887551,Frank,Candela,,,02/01/1997 - 09/01/2000,Y,no,N,4/29/2013,2013,Milwaukee Brewers,/workers-comp-mlb/popup/ADJ8887551.html
ADJ8755222,John,Candelaria,P,Pitcher,02/01/1972 - 10/01/1993,Y,no,N,2/7/2013,2013,Pittsburgh Pirates,/workers-comp-mlb/popup/ADJ8755222.html
ADJ8883409,Tom,Candiotti,P,Pitcher,01/05/1980 - 04/15/2000,Y,yes,N,4/25/2013,2013,Los Angeles Angeles,/workers-comp-mlb/popup/ADJ8883409.html
ADJ8754632,John,Cangelosi,OF-PH,Outfielder and Pinch hitter,02/01/1982 - 10/01/1999,Y,no,N,2/7/2013,2013,"Colorado Rockies,Houston McLane",/workers-comp-mlb/popup/ADJ8754632.html
ADJ1125570,Chris ,Cannizzaro,C,Catcher,6/15/1969,N,yes,N,10/30/1998,1998,"San Diego Padres,Fremont Compensation Insurance",/workers-comp-mlb/popup/ADJ1125570.html
ADJ1575184,Chris ,Cannizzaro,C,Catcher,10/30/1998,N,yes,N,10/30/1998,1998,San Diego Padres,/workers-comp-mlb/popup/ADJ1575184.html
ADJ1983110,Chris ,Cannizzaro,C,Catcher,9/15/1970,N,yes,N,10/30/1998,1998,San Diego Padres,/workers-comp-mlb/popup/ADJ1983110.html
ADJ2575608,Chris ,Cannizzaro,C,Catcher,2/15/1975,N,yes,N,11/2/1998,1998,San Diego Padres,/workers-comp-mlb/popup/ADJ2575608.html
ADJ3485649,Chris ,Cannizzaro,C,Catcher,7/15/1970,N,yes,N,11/2/1998,1998,San Diego Padres,/workers-comp-mlb/popup/ADJ3485649.html
ADJ492395,Chris ,Cannizzaro,C,Catcher,8/15/1972,N,yes,N,11/2/1998,1998,"Los Angeles Dodgers,Trovillion Inveiss Ponticello",/workers-comp-mlb/popup/ADJ492395.html
ADJ806226,Chris ,Cannizzaro,C,Catcher,2/15/1973,N,yes,N,11/2/1998,1998,"Los Angeles Dodgers,Trovillion Inveiss Ponticello",/workers-comp-mlb/popup/ADJ806226.html
ADJ935229,Chris ,Cannizzaro,C,Catcher,2/15/1972,N,yes,N,10/30/1998,1998,"Los Angeles Dodgers,Trovillion Inveiss Ponticello",/workers-comp-mlb/popup/ADJ935229.html
ADJ7685615,Jose,Canseco,OF-DH,Outfielder and Designated hitter,01/01/1998 - 12/31/2000,Y,no,Y,2/4/2011,2011,"Toronto Blue Jays,Tampa Bay Rays",/workers-comp-mlb/popup/ADJ7685615.html
ADJ7593648,Ozzie,Canseco,LF-PH,Left fielder and Pinch hitter,01/01/1983 - 12/31/1999,Y,yes,Y,12/9/2010,2010,"Oakland Athletics,St. Louis Cardinals",/workers-comp-mlb/popup/ADJ7593648.html
ADJ8908486,Jeff,Carter,OF-2B-3B,"Outfielder, Second baseman and Third baseman",06/01/1985 - 09/30/1996,Y,yes,Y,5/13/2013,2013,San Francisco Giants,/workers-comp-mlb/popup/ADJ8908486.html
ADJ8578845,Lance,Carter,P,Pitcher,06/12/1994 - 03/21/2008,Y,yes,Y,10/15/2012,2012,Los Angeles Dodgers,/workers-comp-mlb/popup/ADJ8578845.html
ADJ8633611,Mike,Carter,OF,Outfielder,02/01/1990 - 04/01/2003,Y,yes,N,11/19/2012,2012,Los Angeles Angeles of Anaheim,/workers-comp-mlb/popup/ADJ8633611.html
ADJ2324478,Rico,Carty,LF-DH-1B,"Left fielder, Designated hitter and First baseman",11/15/1979 - 11/15/1980,Y,yes,N,9/29/1987,1987,"Cleveland Indians,Texas Rangers,Oakland Athletics,Chicago Cubs,Toronto Blue Jays,Atlanta Braves",/workers-comp-mlb/popup/ADJ2324478.html
ADJ8212560,Raul,Casanova,C,Catcher,06/11/1990 - 09/30/2008,Y,yes,Y,2/24/2012,2012,"Tampa Bay Devil Rays,Kansas City Royals,Chicago White Sox,New York Mets,Detroit Tigers,Oakland Athletics",/workers-comp-mlb/popup/ADJ8212560.html
ADJ7745912,Uriel,Casillas,,,06/01/1997 - 09/01/2003,Y,no,N,10/26/2010,2010,Philadelphia Phillies,/workers-comp-mlb/popup/ADJ7745912.html
ADJ8900872,Braulio,Castillo,OF,Outfielder,10/10/1985 - 07/30/1991,Y,yes,Y,5/7/2013,2013,Los Angeles Dodgers,/workers-comp-mlb/popup/ADJ8900872.html
ADJ8864858,Bill,Caudill,P,Pitcher,05/12/1979 - 07/28/1987,Y,yes,Y,4/15/2013,2013,Oakland Athletics,/workers-comp-mlb/popup/ADJ8864858.html
ADJ8907849,Josh,Cephas,P,Pitcher,06/01/2010 - 10/15/2012,Y,yes,Y,5/13/2013,2013,San Diego Padres,/workers-comp-mlb/popup/ADJ8907849.html
ADJ8456989,Jaime,Cerda,P,Pitcher,06/02/1998 - 07/13/2007,Y,no,Y,7/27/2012,2012,"Kansas City Royals,New York Mets",/workers-comp-mlb/popup/ADJ8456989.html
ADJ1251170,Christopher,Chapman,,,06/15/1986 - 06/15/1987,Y,yes,N,6/1/1987,1987,Los Angeles Dodgers,/workers-comp-mlb/popup/ADJ1251170.html